How can i get the notification of new email without email client?

by android.vinny » Fri, 24 Jul 2009 13:33:31 GMT


Sponsored Links
 HI
How can i get the notification in my app with out any email client
code written in my app.
for where i can cathc tht enotification when a new mail i got to inbox
i want to show some message when i get a new email......and i need to
open that mail.....

thanks in advance......
--~--~---------~--~----~------------~-------~--~----~



Other Threads

1. problem in building the kernel

CC [M] fs/yaffs2/yaffs_fs.o
fs/yaffs2/yaffs_fs.c:192: error: 'generic_file_read' undeclared here
(not in a function)
fs/yaffs2/yaffs_fs.c:193: error: 'generic_file_write' undeclared here
(not in a function)
fs/yaffs2/yaffs_fs.c: In function 'yaffs_readlink':
fs/yaffs2/yaffs_fs.c:263: error: 'struct inode' has no member named
'u'
fs/yaffs2/yaffs_fs.c:267: error: 'struct inode' has no member named
'u'
fs/yaffs2/yaffs_fs.c: In function 'yaffs_follow_link':
fs/yaffs2/yaffs_fs.c:287: error: 'struct inode' has no member named
'u'
fs/yaffs2/yaffs_fs.c:291: error: 'struct inode' has no member named
'u'
fs/yaffs2/yaffs_fs.c: In function 'yaffs_lookup':
fs/yaffs2/yaffs_fs.c:328: error: 'struct inode' has no member named
'u'
fs/yaffs2/yaffs_fs.c:332: error: 'struct inode' has no member named
'u'
fs/yaffs2/yaffs_fs.c:337: error: 'struct inode' has no member named
'u'
fs/yaffs2/yaffs_fs.c: In function 'yaffs_clear_inode':
fs/yaffs2/yaffs_fs.c:396: error: 'struct inode' has no member named
'u'
fs/yaffs2/yaffs_fs.c:411: error: 'struct inode' has no member named
'u'
fs/yaffs2/yaffs_fs.c: In function 'yaffs_delete_inode':
fs/yaffs2/yaffs_fs.c:432: error: 'struct inode' has no member named
'u'
fs/yaffs2/yaffs_fs.c: In function 'yaffs_file_flush':
fs/yaffs2/yaffs_fs.c:458: error: 'struct inode' has no member named
'u'
fs/yaffs2/yaffs_fs.c: In function 'yaffs_readpage_nolock':
fs/yaffs2/yaffs_fs.c:489: error: 'struct inode' has no member named
'u'
fs/yaffs2/yaffs_fs.c: In function 'yaffs_writepage':
fs/yaffs2/yaffs_fs.c:589: error: 'struct inode' has no member named
'u'
fs/yaffs2/yaffs_fs.c: In function 'yaffs_FillInodeFromObject':
fs/yaffs2/yaffs_fs.c:707: error: 'struct inode' has no member named
'i_blksize'
fs/yaffs2/yaffs_fs.c:759: error: 'struct inode' has no member named
'u'
fs/yaffs2/yaffs_fs.c: In function 'yaffs_file_write':
fs/yaffs2/yaffs_fs.c:808: error: 'struct inode' has no member named
'u'
fs/yaffs2/yaffs_fs.c:826: warning: format '%d' expects type 'int', but
argument 2 has type 'size_t'
fs/yaffs2/yaffs_fs.c:835: warning: format '%d' expects type 'int', but
argument 2 has type 'size_t'
fs/yaffs2/yaffs_fs.c: In function 'yaffs_readdir':
fs/yaffs2/yaffs_fs.c:868: error: 'struct inode' has no member named
'u'
fs/yaffs2/yaffs_fs.c: In function 'yaffs_mknod':
fs/yaffs2/yaffs_fs.c:962: error: 'struct inode' has no member named
'u'
fs/yaffs2/yaffs_fs.c: In function 'yaffs_unlink':
fs/yaffs2/yaffs_fs.c:1077: error: 'struct inode' has no member named
'u'
fs/yaffs2/yaffs_fs.c:1081: error: 'struct inode' has no member named
'u'
fs/yaffs2/yaffs_fs.c: In function 'yaffs_link':
fs/yaffs2/yaffs_fs.c:1107: error: 'struct inode' has no member named
'u'
fs/yaffs2/yaffs_fs.c:1115: error: 'struct inode' has no member named
'u'
fs/yaffs2/yaffs_fs.c: In function 'yaffs_symlink':
fs/yaffs2/yaffs_fs.c:1150: error: 'struct inode' has no member named
'u'
fs/yaffs2/yaffs_fs.c:1152: error: 'struct inode' has no member named
'u'
fs/yaffs2/yaffs_fs.c: In function 'yaffs_sync_object':
fs/yaffs2/yaffs_fs.c:1179: error: 'struct inode' has no member named
'u'
fs/yaffs2/yaffs_fs.c: In function 'yaffs_rename':
fs/yaffs2/yaffs_fs.c:1203: error: 'struct inode' has no member named
'u'
fs/yaffs2/yaffs_fs.c:1209: error: 'struct inode' has no member named
'u'
fs/yaffs2/yaffs_fs.c:1227: error: 'struct inode' has no member named
'u'
fs/yaffs2/yaffs_fs.c:1229: error: 'struct inode' has no member named
'u'
fs/yaffs2/yaffs_fs.c: In function 'yaffs_setattr':
fs/yaffs2/yaffs_fs.c:1254: error: 'struct inode' has no member named
'u'
fs/yaffs2/yaffs_fs.c:1260: error: 'struct inode' has no member named
'u'
fs/yaffs2/yaffs_fs.c:1262: error: 'struct inode' has no member named
'u'
fs/yaffs2/yaffs_fs.c: In function 'yaffs_statfs':
fs/yaffs2/yaffs_fs.c:1278: error: 'struct inode' has no member named
'u'
make[3]: *** [fs/yaffs2/yaffs_fs.o] Error 1
make[2]: *** [fs/yaffs2] Error 2
make[1]: *** [fs] Error 2

pls help me to solve the problem

--~--~---------~--~----~------------~-------~--~----~

2. Application error. Error Inflating class

Hi Frndz,

I am encountering an Application error when I am trying to open a
ListActivity from another activity using startActivity().

The error is

"Application error:<package name>"
"An error has occured in <package name>.Binary xml file line #xxx:
Error inflating class accelerateInterpolator."

The source code of the class extending ListActivity is

import android.app.ListActivity;
import android.os.Bundle;
import android.widget.ArrayAdapter;

public class MainMenuList extends ListActivity {
       private String[] listItems = {"Login", "Edit Settings"};

       protected void onCreate(Bundle icicle) {
               super.onCreate(icicle);
       setListAdapter(new ArrayAdapter<String>(this,
               android.R.layout.simple_list_item_1, listItems));
       }
}

The entry for this activity is also present in the AndroidManifest.xml
file.

I am Eclipse 3.4 with the "android-sdk_m5-rc15_windows" sdk.

Do any one have encountered this error earlier. How can I solve it?

Thanks
Deepanjan

--~--~---------~--~----~------------~-------~--~----~

3. problem during yaffs2 compiling

4. Question About Application Ideas

5. Industry Standard article on deciding which mobile platform to develop for

6. Help on GTalk group chat

7. what and why are they developing on android for?