Android SMS Storage

by mafro » Fri, 13 Mar 2009 01:47:41 GMT


Sponsored Links
 Does anyone know where I can edit my SMS messages saved on the phone?
I would like to 'clean up' some of the 'Sent To' / 'Received From'
numbers so my messages display in the thread form correctly.

Refer to this thread on android-platform for the reason behind this!



Other Threads

1. Problems extending AbsSeekBar, ProgressBar and SeekBar

Hello,

I'm modifying the SeekBar a little bit but I'm having troubles with
the "com.android.internal.R.stylable". In a 2-hour research I found
that the best way to fix it is to do something like the following:


# resources.xml

<?xml version="1.0" encoding="utf-8"?>
<resources xmlns:android="http://schemas.android.com/apk/res/android">
        <declare-styleable name="SeekBar">
                <attr name="android:SeekBar"/>
    </declare-styleable>

    <declare-styleable name="SeekBar_thumb">
                <attr name="android:SeekBar_thumb"/>
    </declare-styleable>

    <declare-styleable name="SeekBar_thumbOffset">
                <attr name="SeekBar_thumbOffset"/>
    </declare-styleable>

        <declare-styleable name="Theme">
                <attr name="android:Theme"/>
    </declare-styleable>

    <declare-styleable name="Theme_disabledAlpha">
                <attr name="android:Theme_disabledAlpha"/>
    </declare-styleable>

</resources>

But I'm getting the following error messages:

[2011-04-08 01:18:47 - AdBoxApp] ERROR: In <declare-styleable>
SeekBar, unable to find attribute android:SeekBar
[2011-04-08 01:18:47 - AdBoxApp] ERROR: In <declare-styleable>
SeekBar_thumb, unable to find attribute android:SeekBar_thumb
[2011-04-08 01:18:47 - AdBoxApp] ERROR: In <declare-styleable>
SeekBar_thumbOffset, unable to find attribute SeekBar_thumbOffset
[2011-04-08 01:18:47 - AdBoxApp] ERROR: In <declare-styleable> Theme,
unable to find attribute android:Theme
[2011-04-08 01:18:47 - AdBoxApp] ERROR: In <declare-styleable>
Theme_disabledAlpha, unable to find attribute
android:Theme_disabledAlpha
[2011-04-08 01:18:48 - AdBoxApp] ERROR: In <declare-styleable>
SeekBar, unable to find attribute android:SeekBar
[2011-04-08 01:18:48 - AdBoxApp] ERROR: In <declare-styleable>
SeekBar_thumb, unable to find attribute android:SeekBar_thumb
[2011-04-08 01:18:48 - AdBoxApp] ERROR: In <declare-styleable>
SeekBar_thumbOffset, unable to find attribute SeekBar_thumbOffset
[2011-04-08 01:18:48 - AdBoxApp] ERROR: In <declare-styleable> Theme,
unable to find attribute android:Theme
[2011-04-08 01:18:48 - AdBoxApp] ERROR: In <declare-styleable>
Theme_disabledAlpha, unable to find attribute
android:Theme_disabledAlpha
[2011-04-08 01:18:49 - AdBoxApp] ERROR: In <declare-styleable>
SeekBar, unable to find attribute android:SeekBar
[2011-04-08 01:18:49 - AdBoxApp] ERROR: In <declare-styleable>
SeekBar_thumb, unable to find attribute android:SeekBar_thumb
[2011-04-08 01:18:49 - AdBoxApp] ERROR: In <declare-styleable>
SeekBar_thumbOffset, unable to find attribute SeekBar_thumbOffset
[2011-04-08 01:18:49 - AdBoxApp] ERROR: In <declare-styleable> Theme,
unable to find attribute android:Theme
[2011-04-08 01:18:49 - AdBoxApp] ERROR: In <declare-styleable>
Theme_disabledAlpha, unable to find attribute
android:Theme_disabledAlpha



How can I discovery the correct XML resource path to these "names"?

Thank you so much!

-- 

2. Android Build Error for 2.3 version

Hi,
I'm facing the following build error.
All the required tools are installed.
I'm using ubuntu 10.04

Install: out/target/product/generic/system/lib/libttssynthproxy.so
Generating CSSPropertyNames.h <= CSSPropertyNames.in
Generating CSSValueKeywords.h <= CSSValueKeywords.in
target Generated: libwebcore <= external/webkit/WebCore/css/make-css-
file-arrays.pl
gcc: error trying to exec 'cc1plus': execvp: No such file or directory
gcc: error trying to exec 'cc1plus': execvp: No such file or directory
gcc: error trying to exec 'cc1plus': execvp: No such file or directory
gcc: error trying to exec 'cc1plus': execvp: No such file or directory
gcc: error trying to exec 'cc1plus': execvp: No such file or directory
target Generated: libwebcore <= external/webkit/WebCore/bindings/js/
JSDOMWindowBase.cpp
Creating hashtable for external/webkit/WebCore/bindings/js/
JSDOMWindowBase.cpp
target Generated: libwebcore <= external/webkit/WebCore/css/
CSSCharsetRule.idl
gcc: error trying to exec 'cc1plus': execvp: No such file or directory
Can't call method "fileName" without a package or object reference at
external/webkit/WebCore/bindings/scripts/IDLParser.pm line 110.
make: *** [out/target/product/generic/obj/STATIC_LIBRARIES/
libwebcore_intermediates/WebCore/css/JSCSSCharsetRule.h] Error 255


But actually I see that file is present in the specified directory.

-- 

3. Difference between Android application and Android service

4. do not get corrent value from window.innerHeight/innerWidth

5. what are 9-patch bad patches?

6. Is it possible to use DDMS to send mock locations to a physical device?

7. How do I initiate/terminate xml-defined SurfaceView upon a button push?